{"text_format":"1","workbook":"xlsx","n_sheets":7,"sheets":["Scoresheet","Instructions","IPF GL Formula","WeightClasses","IPFDivision","carga","Premiacion"],"not_rendered":{"charts":0,"images":10,"macros":1,"external_links":0,"defined_names":1,"comments":0,"pivot_tables":0},"unopened":[],"bounds":{"document_bytes":16777216,"sheet_cells":100000,"rows_first":2000,"rows_last":500,"rows_between":2000,"halvings":0,"cell_chars":16384,"cell_head_chars":4096},"cells_cut":0,"cells_raw":0,"read":"whole","date_system":"1900"}

{"sheet":"Scoresheet","index":0,"n_rows":38,"n_cols":49,"rows_kept":38,"cut":false,"hidden":false,"merged":[[0,0,2,8],[1,23,1,27],[3,10,3,11],[3,27,3,28],[3,29,3,30],[3,25,3,26],[3,12,3,13],[3,14,3,15],[3,18,3,19],[3,20,3,21],[3,22,3,23]]}
["25+2.5",null,null,null,null,null,null,null,null,null,null,null,null,null,null,null,null,null,null,null,"√"]
[null,null,null,null,null,null,null,null,null,null,null,null,null,null,null,null,null,null,null,"×","×","NoLift","√"]
[null,null,null,null,null,null,null,null,null,null,null,null,null,null,"Apertura 2025 Kloster Gym"]
["Gr.","Lot","IPF Division","Name","Team","Birth Year","Division","Body Wt","WT Class","SQ rack","SQ-1",null,"SQ-2",null,"SQ-3",null,"Best SQ","BP rack","BP-1",null,"BP-2",null,"BP-3",null,"Best BP","DL-1",null,"DL-2",null,"DL-3",null,"Best DL","TOTAL","IPF GL Pts.","IPF GL Coeff."]
[null,null,null,null,null,null,null,null,{"$f":"IF(H5=\"\",\"\",VLOOKUP(H5,WeightClasses!$A$2:$E$18,IF(LEFT(G5,1)=\"F\",IF(YEAR(TODAY())-F5<24,4,2),IF(YEAR(TODAY())-F5<24,5,3)),TRUE))","v":""},null,null,null,null,null,null,null,{"$f":"IF(OR(L5<>0,N5<>0,P5<>0),MAX(IF(K5=$U$1,L5,0),IF(M5=$U$1,N5,0),IF(O5=$U$1,P5,0)),\"\")","v":""},null,null,null,null,null,null,null,{"$f":"IF(OR(T5<>0,V5<>0,X5<>0),MAX(IF(S5=$U$1,T5,0),IF(U5=$U$1,V5,0),IF(W5=$U$1,X5,0)),\"\")","v":""},null,null,null,null,null,null,{"$f":"IF(OR(AA5<>0,AC5<>0,AE5<>0),MAX(IF(Z5=$U$1,AA5,0),IF(AB5=$U$1,AC5,0),IF(AD5=$U$1,AE5,0)),\"\")","v":""},{"$f":"IF(OR(Q5<>\"\",Y5<>\"\",AF5<>\"\"),IF(AW5,\"DSQ\",IF(AND(RIGHT(G5,2)=\"PL\"),IF(Q5=\"\",0,Q5)+IF(Y5=\"\",0,Y5)+IF(AF5=\"\",0,AF5),IF(AND(RIGHT(G5,2)=\"BP\",Y5<>0),Y5,0))),\"\")","v":""},{"$f":"IF(AND(AG5<>\"\",ISNUMBER(AG5)),AI5*AG5,\"\")","v":""},{"$f":"IF(OR(H5=\"\",H5=0),0, ROUND(100/(VLOOKUP($G5,'IPF GL Formula'!$A$4:$F$11,3,FALSE)-VLOOKUP($G5,'IPF GL Formula'!$A$4:$F$11,4,FALSE)*EXP(-VLOOKUP($G5,'IPF GL Formula'!$A$4:$F$11,5,FALSE)*H5)),6))","v":0},null,{"$f":"K5=$U$2","v":false},{"$f":"M5=$U$2","v":false},{"$f":"O5=$U$2","v":false},{"$f":"S5=$U$2","v":false},{"$f":"U5=$U$2","v":false},{"$f":"W5=$U$2","v":false},{"$f":"Z5=$U$2","v":false},{"$f":"AB5=$U$2","v":false},{"$f":"AD5=$U$2","v":false},{"$f":"AND(AK5,AL5,AM5)","v":false},{"$f":"AND(AN5,AO5,AP5)","v":false},{"$f":"AND(AQ5,AR5,AS5)","v":false},{"$f":"OR(AT5,AU5,AV5)","v":false}]
[null,null,null,null,null,null,null,null,{"$f":"IF(H6=\"\",\"\",VLOOKUP(H6,WeightClasses!$A$2:$E$18,IF(LEFT(G6,1)=\"F\",IF(YEAR(TODAY())-F6<24,4,2),IF(YEAR(TODAY())-F6<24,5,3)),TRUE))","v":""},null,null,null,null,null,null,null,"",null,null,null,null,null,null,null,"",null,null,null,null,null,null,"","","",{"$f":"IF(OR(H6=\"\",H6=0),0, ROUND(100/(VLOOKUP($G6,'IPF GL Formula'!$A$4:$F$11,3,FALSE)-VLOOKUP($G6,'IPF GL Formula'!$A$4:$F$11,4,FALSE)*EXP(-VLOOKUP($G6,'IPF GL Formula'!$A$4:$F$11,5,FALSE)*H6)),6))","v":0},null,false,false,false,false,false,false,false,false,false,false,false,false,false]
[null,null,null,null,null,null,null,null,{"$f":"IF(H7=\"\",\"\",VLOOKUP(H7,WeightClasses!$A$2:$E$18,IF(LEFT(G7,1)=\"F\",IF(YEAR(TODAY())-F7<24,4,2),IF(YEAR(TODAY())-F7<24,5,3)),TRUE))","v":""},null,null,null,null,null,null,null,"",null,null,null,null,null,null,null,"",null,null,null,null,null,null,"","","",{"$f":"IF(OR(H7=\"\",H7=0),0, ROUND(100/(VLOOKUP($G7,'IPF GL Formula'!$A$4:$F$11,3,FALSE)-VLOOKUP($G7,'IPF GL Formula'!$A$4:$F$11,4,FALSE)*EXP(-VLOOKUP($G7,'IPF GL Formula'!$A$4:$F$11,5,FALSE)*H7)),6))","v":0},null,false,false,false,false,false,false,false,false,false,false,false,false,false]
[null,null,null,null,null,null,null,null,{"$f":"IF(H8=\"\",\"\",VLOOKUP(H8,WeightClasses!$A$2:$E$18,IF(LEFT(G8,1)=\"F\",IF(YEAR(TODAY())-F8<24,4,2),IF(YEAR(TODAY())-F8<24,5,3)),TRUE))","v":""},null,null,null,null,null,null,null,"",null,null,null,null,null,null,null,"",null,null,null,null,null,null,"","","",{"$f":"IF(OR(H8=\"\",H8=0),0, ROUND(100/(VLOOKUP($G8,'IPF GL Formula'!$A$4:$F$11,3,FALSE)-VLOOKUP($G8,'IPF GL Formula'!$A$4:$F$11,4,FALSE)*EXP(-VLOOKUP($G8,'IPF GL Formula'!$A$4:$F$11,5,FALSE)*H8)),6))","v":0},null,false,false,false,false,false,false,false,false,false,false,false,false,false]
[null,null,null,null,null,null,null,null,{"$f":"IF(H9=\"\",\"\",VLOOKUP(H9,WeightClasses!$A$2:$E$18,IF(LEFT(G9,1)=\"F\",IF(YEAR(TODAY())-F9<24,4,2),IF(YEAR(TODAY())-F9<24,5,3)),TRUE))","v":""},null,null,null,null,null,null,null,"",null,null,null,null,null,null,null,"",null,null,null,null,null,null,"","","",{"$f":"IF(OR(H9=\"\",H9=0),0, ROUND(100/(VLOOKUP($G9,'IPF GL Formula'!$A$4:$F$11,3,FALSE)-VLOOKUP($G9,'IPF GL Formula'!$A$4:$F$11,4,FALSE)*EXP(-VLOOKUP($G9,'IPF GL Formula'!$A$4:$F$11,5,FALSE)*H9)),6))","v":0},null,false,false,false,false,false,false,false,false,false,false,false,false,false]
[null,null,null,null,null,null,null,null,{"$f":"IF(H10=\"\",\"\",VLOOKUP(H10,WeightClasses!$A$2:$E$18,IF(LEFT(G10,1)=\"F\",IF(YEAR(TODAY())-F10<24,4,2),IF(YEAR(TODAY())-F10<24,5,3)),TRUE))","v":""},null,null,null,null,null,null,null,"",null,null,null,null,null,null,null,"",null,null,null,null,null,null,"","","",{"$f":"IF(OR(H10=\"\",H10=0),0, ROUND(100/(VLOOKUP($G10,'IPF GL Formula'!$A$4:$F$11,3,FALSE)-VLOOKUP($G10,'IPF GL Formula'!$A$4:$F$11,4,FALSE)*EXP(-VLOOKUP($G10,'IPF GL Formula'!$A$4:$F$11,5,FALSE)*H10)),6))","v":0},null,false,false,false,false,false,false,false,false,false,false,false,false,false]
[null,null,null,null,null,null,null,null,{"$f":"IF(H11=\"\",\"\",VLOOKUP(H11,WeightClasses!$A$2:$E$18,IF(LEFT(G11,1)=\"F\",IF(YEAR(TODAY())-F11<24,4,2),IF(YEAR(TODAY())-F11<24,5,3)),TRUE))","v":""},null,null,null,null,null,null,null,"",null,null,null,null,null,null,null,"",null,null,null,null,null,null,"","","",{"$f":"IF(OR(H11=\"\",H11=0),0, ROUND(100/(VLOOKUP($G11,'IPF GL Formula'!$A$4:$F$11,3,FALSE)-VLOOKUP($G11,'IPF GL Formula'!$A$4:$F$11,4,FALSE)*EXP(-VLOOKUP($G11,'IPF GL Formula'!$A$4:$F$11,5,FALSE)*H11)),6))","v":0},null,false,false,false,false,false,false,false,false,false,false,false,false,false]
[]
[]
[]
[]
[]
[]
[null,null,null,null,null,null,null,null,{"$f":"IF(H18=\"\",\"\",VLOOKUP(H18,WeightClasses!$A$2:$E$18,IF(LEFT(G18,1)=\"F\",IF(YEAR(TODAY())-F18<24,4,2),IF(YEAR(TODAY())-F18<24,5,3)),TRUE))","v":""},null,null,null,null,null,null,null,{"$f":"IF(OR(L18<>0,N18<>0,P18<>0),MAX(IF(K18=$U$1,L18,0),IF(M18=$U$1,N18,0),IF(O18=$U$1,P18,0)),\"\")","v":""},null,null,null,null,null,null,null,{"$f":"IF(OR(T18<>0,V18<>0,X18<>0),MAX(IF(S18=$U$1,T18,0),IF(U18=$U$1,V18,0),IF(W18=$U$1,X18,0)),\"\")","v":""},null,null,null,null,null,null,{"$f":"IF(OR(AA18<>0,AC18<>0,AE18<>0),MAX(IF(Z18=$U$1,AA18,0),IF(AB18=$U$1,AC18,0),IF(AD18=$U$1,AE18,0)),\"\")","v":""},{"$f":"IF(OR(Q18<>\"\",Y18<>\"\",AF18<>\"\"),IF(AW18,\"DSQ\",IF(AND(RIGHT(G18,2)=\"PL\"),IF(Q18=\"\",0,Q18)+IF(Y18=\"\",0,Y18)+IF(AF18=\"\",0,AF18),IF(AND(RIGHT(G18,2)=\"BP\",Y18<>0),Y18,0))),\"\")","v":""},{"$f":"IF(AND(AG18<>\"\",ISNUMBER(AG18)),AI18*AG18,\"\")","v":""},{"$f":"IF(OR(H18=\"\",H18=0),0, ROUND(100/(VLOOKUP($G18,'IPF GL Formula'!$A$4:$F$11,3,FALSE)-VLOOKUP($G18,'IPF GL Formula'!$A$4:$F$11,4,FALSE)*EXP(-VLOOKUP($G18,'IPF GL Formula'!$A$4:$F$11,5,FALSE)*H18)),6))","v":0},null,{"$f":"K18=$U$2","v":false},{"$f":"M18=$U$2","v":false},{"$f":"O18=$U$2","v":false},{"$f":"S18=$U$2","v":false},{"$f":"U18=$U$2","v":false},{"$f":"W18=$U$2","v":false},{"$f":"Z18=$U$2","v":false},{"$f":"AB18=$U$2","v":false},{"$f":"AD18=$U$2","v":false},{"$f":"AND(AK18,AL18,AM18)","v":false},{"$f":"AND(AN18,AO18,AP18)","v":false},{"$f":"AND(AQ18,AR18,AS18)","v":false},{"$f":"OR(AT18,AU18,AV18)","v":false}]
[null,null,null,null,null,null,null,null,{"$f":"IF(H19=\"\",\"\",VLOOKUP(H19,WeightClasses!$A$2:$E$18,IF(LEFT(G19,1)=\"F\",IF(YEAR(TODAY())-F19<24,4,2),IF(YEAR(TODAY())-F19<24,5,3)),TRUE))","v":""},null,null,null,null,null,null,null,"",null,null,null,null,null,null,null,"",null,null,null,null,null,null,"","","",{"$f":"IF(OR(H19=\"\",H19=0),0, ROUND(100/(VLOOKUP($G19,'IPF GL Formula'!$A$4:$F$11,3,FALSE)-VLOOKUP($G19,'IPF GL Formula'!$A$4:$F$11,4,FALSE)*EXP(-VLOOKUP($G19,'IPF GL Formula'!$A$4:$F$11,5,FALSE)*H19)),6))","v":0},null,false,false,false,false,false,false,false,false,false,false,false,false,false]
[null,null,null,null,null,null,null,null,{"$f":"IF(H20=\"\",\"\",VLOOKUP(H20,WeightClasses!$A$2:$E$18,IF(LEFT(G20,1)=\"F\",IF(YEAR(TODAY())-F20<24,4,2),IF(YEAR(TODAY())-F20<24,5,3)),TRUE))","v":""},null,null,null,null,null,null,null,"",null,null,null,null,null,null,null,"",null,null,null,null,null,null,"","","",{"$f":"IF(OR(H20=\"\",H20=0),0, ROUND(100/(VLOOKUP($G20,'IPF GL Formula'!$A$4:$F$11,3,FALSE)-VLOOKUP($G20,'IPF GL Formula'!$A$4:$F$11,4,FALSE)*EXP(-VLOOKUP($G20,'IPF GL Formula'!$A$4:$F$11,5,FALSE)*H20)),6))","v":0},null,false,false,false,false,false,false,false,false,false,false,false,false,false]
[null,null,null,null,null,null,null,null,{"$f":"IF(H21=\"\",\"\",VLOOKUP(H21,WeightClasses!$A$2:$E$18,IF(LEFT(G21,1)=\"F\",IF(YEAR(TODAY())-F21<24,4,2),IF(YEAR(TODAY())-F21<24,5,3)),TRUE))","v":""},null,null,null,null,null,null,null,"",null,null,null,null,null,null,null,"",null,null,null,null,null,null,"","","",{"$f":"IF(OR(H21=\"\",H21=0),0, ROUND(100/(VLOOKUP($G21,'IPF GL Formula'!$A$4:$F$11,3,FALSE)-VLOOKUP($G21,'IPF GL Formula'!$A$4:$F$11,4,FALSE)*EXP(-VLOOKUP($G21,'IPF GL Formula'!$A$4:$F$11,5,FALSE)*H21)),6))","v":0},null,false,false,false,false,false,false,false,false,false,false,false,false,false]
[null,null,null,null,null,null,null,null,{"$f":"IF(H22=\"\",\"\",VLOOKUP(H22,WeightClasses!$A$2:$E$18,IF(LEFT(G22,1)=\"F\",IF(YEAR(TODAY())-F22<24,4,2),IF(YEAR(TODAY())-F22<24,5,3)),TRUE))","v":""},null,null,null,null,null,null,null,"",null,null,null,null,null,null,null,"",null,null,null,null,null,null,"","","",{"$f":"IF(OR(H22=\"\",H22=0),0, ROUND(100/(VLOOKUP($G22,'IPF GL Formula'!$A$4:$F$11,3,FALSE)-VLOOKUP($G22,'IPF GL Formula'!$A$4:$F$11,4,FALSE)*EXP(-VLOOKUP($G22,'IPF GL Formula'!$A$4:$F$11,5,FALSE)*H22)),6))","v":0},null,false,false,false,false,false,false,false,false,false,false,false,false,false]
[null,null,null,null,null,null,null,null,{"$f":"IF(H23=\"\",\"\",VLOOKUP(H23,WeightClasses!$A$2:$E$18,IF(LEFT(G23,1)=\"F\",IF(YEAR(TODAY())-F23<24,4,2),IF(YEAR(TODAY())-F23<24,5,3)),TRUE))","v":""},null,null,null,null,null,null,null,"",null,null,null,null,null,null,null,"",null,null,null,null,null,null,"","","",{"$f":"IF(OR(H23=\"\",H23=0),0, ROUND(100/(VLOOKUP($G23,'IPF GL Formula'!$A$4:$F$11,3,FALSE)-VLOOKUP($G23,'IPF GL Formula'!$A$4:$F$11,4,FALSE)*EXP(-VLOOKUP($G23,'IPF GL Formula'!$A$4:$F$11,5,FALSE)*H23)),6))","v":0},null,false,false,false,false,false,false,false,false,false,false,false,false,false]
[null,null,null,null,null,null,null,null,{"$f":"IF(H24=\"\",\"\",VLOOKUP(H24,WeightClasses!$A$2:$E$18,IF(LEFT(G24,1)=\"F\",IF(YEAR(TODAY())-F24<24,4,2),IF(YEAR(TODAY())-F24<24,5,3)),TRUE))","v":""},null,null,null,null,null,null,null,"",null,null,null,null,null,null,null,"",null,null,null,null,null,null,"","","",{"$f":"IF(OR(H24=\"\",H24=0),0, ROUND(100/(VLOOKUP($G24,'IPF GL Formula'!$A$4:$F$11,3,FALSE)-VLOOKUP($G24,'IPF GL Formula'!$A$4:$F$11,4,FALSE)*EXP(-VLOOKUP($G24,'IPF GL Formula'!$A$4:$F$11,5,FALSE)*H24)),6))","v":0},null,false,false,false,false,false,false,false,false,false,false,false,false,false]
[null,null,null,null,null,null,null,null,{"$f":"IF(H25=\"\",\"\",VLOOKUP(H25,WeightClasses!$A$2:$E$18,IF(LEFT(G25,1)=\"F\",IF(YEAR(TODAY())-F25<24,4,2),IF(YEAR(TODAY())-F25<24,5,3)),TRUE))","v":""},null,null,null,null,null,null,null,"",null,null,null,null,null,null,null,"",null,null,null,null,null,null,"","","",{"$f":"IF(OR(H25=\"\",H25=0),0, ROUND(100/(VLOOKUP($G25,'IPF GL Formula'!$A$4:$F$11,3,FALSE)-VLOOKUP($G25,'IPF GL Formula'!$A$4:$F$11,4,FALSE)*EXP(-VLOOKUP($G25,'IPF GL Formula'!$A$4:$F$11,5,FALSE)*H25)),6))","v":0},null,false,false,false,false,false,false,false,false,false,false,false,false,false]
[null,null,null,null,null,null,null,null,{"$f":"IF(H26=\"\",\"\",VLOOKUP(H26,WeightClasses!$A$2:$E$18,IF(LEFT(G26,1)=\"F\",IF(YEAR(TODAY())-F26<24,4,2),IF(YEAR(TODAY())-F26<24,5,3)),TRUE))","v":""},null,null,null,null,null,null,null,"",null,null,null,null,null,null,null,"",null,null,null,null,null,null,"","","",{"$f":"IF(OR(H26=\"\",H26=0),0, ROUND(100/(VLOOKUP($G26,'IPF GL Formula'!$A$4:$F$11,3,FALSE)-VLOOKUP($G26,'IPF GL Formula'!$A$4:$F$11,4,FALSE)*EXP(-VLOOKUP($G26,'IPF GL Formula'!$A$4:$F$11,5,FALSE)*H26)),6))","v":0},null,false,false,false,false,false,false,false,false,false,false,false,false,false]
[null,null,null,null,null,null,null,null,{"$f":"IF(H27=\"\",\"\",VLOOKUP(H27,WeightClasses!$A$2:$E$18,IF(LEFT(G27,1)=\"F\",IF(YEAR(TODAY())-F27<24,4,2),IF(YEAR(TODAY())-F27<24,5,3)),TRUE))","v":""},null,null,null,null,null,null,null,"",null,null,null,null,null,null,null,"",null,null,null,null,null,null,"","","",{"$f":"IF(OR(H27=\"\",H27=0),0, ROUND(100/(VLOOKUP($G27,'IPF GL Formula'!$A$4:$F$11,3,FALSE)-VLOOKUP($G27,'IPF GL Formula'!$A$4:$F$11,4,FALSE)*EXP(-VLOOKUP($G27,'IPF GL Formula'!$A$4:$F$11,5,FALSE)*H27)),6))","v":0},null,false,false,false,false,false,false,false,false,false,false,false,false,false]
[null,null,null,null,null,null,null,null,{"$f":"IF(H28=\"\",\"\",VLOOKUP(H28,WeightClasses!$A$2:$E$18,IF(LEFT(G28,1)=\"F\",IF(YEAR(TODAY())-F28<24,4,2),IF(YEAR(TODAY())-F28<24,5,3)),TRUE))","v":""},null,null,null,null,null,null,null,"",null,null,null,null,null,null,null,"",null,null,null,null,null,null,"","","",{"$f":"IF(OR(H28=\"\",H28=0),0, ROUND(100/(VLOOKUP($G28,'IPF GL Formula'!$A$4:$F$11,3,FALSE)-VLOOKUP($G28,'IPF GL Formula'!$A$4:$F$11,4,FALSE)*EXP(-VLOOKUP($G28,'IPF GL Formula'!$A$4:$F$11,5,FALSE)*H28)),6))","v":0},null,false,false,false,false,false,false,false,false,false,false,false,false,false]
[null,null,null,null,null,null,null,null,{"$f":"IF(H29=\"\",\"\",VLOOKUP(H29,WeightClasses!$A$2:$E$18,IF(LEFT(G29,1)=\"F\",IF(YEAR(TODAY())-F29<24,4,2),IF(YEAR(TODAY())-F29<24,5,3)),TRUE))","v":""},null,null,null,null,null,null,null,"",null,null,null,null,null,null,null,"",null,null,null,null,null,null,"","","",{"$f":"IF(OR(H29=\"\",H29=0),0, ROUND(100/(VLOOKUP($G29,'IPF GL Formula'!$A$4:$F$11,3,FALSE)-VLOOKUP($G29,'IPF GL Formula'!$A$4:$F$11,4,FALSE)*EXP(-VLOOKUP($G29,'IPF GL Formula'!$A$4:$F$11,5,FALSE)*H29)),6))","v":0},null,false,false,false,false,false,false,false,false,false,false,false,false,false]
[null,null,null,null,null,null,null,null,{"$f":"IF(H30=\"\",\"\",VLOOKUP(H30,WeightClasses!$A$2:$E$18,IF(LEFT(G30,1)=\"F\",IF(YEAR(TODAY())-F30<24,4,2),IF(YEAR(TODAY())-F30<24,5,3)),TRUE))","v":""},null,null,null,null,null,null,null,"",null,null,null,null,null,null,null,"",null,null,null,null,null,null,"","","",{"$f":"IF(OR(H30=\"\",H30=0),0, ROUND(100/(VLOOKUP($G30,'IPF GL Formula'!$A$4:$F$11,3,FALSE)-VLOOKUP($G30,'IPF GL Formula'!$A$4:$F$11,4,FALSE)*EXP(-VLOOKUP($G30,'IPF GL Formula'!$A$4:$F$11,5,FALSE)*H30)),6))","v":0},null,false,false,false,false,false,false,false,false,false,false,false,false,false]
{"$rows_left_out":9}
{"sheet":"Instructions","index":1,"n_rows":82,"n_cols":3,"rows_kept":82,"cut":false,"hidden":false,"merged":[]}
[]
[null,"1.  Enter lifter information into the spreadsheet in the approriate columns.  Column titles can be changed or Translated to another language after Unprotecting the Spreadsheet."]
[null,null,"A separate Scoresheet can be created for each Men/Women, Classic/Equipped, Powerlifting/Bench Press or they may all be entered on the same scoresheet."]
[]
[null,"2.  When Birth Year and Body Weight are entered the will automatically determine the correct WT Class."]
[]
[null,"3.  Any of the 8 IPF GL Formulas can be selected for a lifter.  A description of the each formula can be found on the IPF GL Formula sheet.  Use the drop down menu in the cell."]
[null,null,"Lifter1 in the first row is entered in Female-Classic-Powerlifting.  The IPF Formula to calculate her IPF Points is F-CL-PL."]
[]
[null,"4.  The gray areas contain formulas and information that will be protected when you Protect the spreadsheet "]
[]
[]
[]
[]
[]
[]
[]
[]
[]
[]
[]
[]
[]
[]
[]
[]
[null,"5.  You may unprotect the Scoresheet to use the sort functions in Excel to group competitors by weight class, age division, or IPF GL Formula."]
[]
[null,"6.  When a lifter completes an attempt, click in the cell next to the weight."]
[null,null,"For a Good Lift select √.  The cell will turn green. Example:  Osmialowski, SQ-1."]
{"$rows_left_out":53}
{"sheet":"IPF GL Formula","index":2,"n_rows":11,"n_cols":5,"rows_kept":11,"cut":false,"hidden":true,"merged":[[0,0,1,4]]}
["Reference Values"]
[]
["IPF GL Formula","Description","A","B","C"]
["M-CL-PL","Male Classic 3-Lift",1199.72839,1025.1816200000001,9.2099999999999994E-3]
["M-CL-BP","Male Classic Bench",320.98041000000001,281.40258,1.008E-2]
["M-EQ-PL","Male Equipped 3-Lift",1236.2511500000001,1449.2186400000001,1.644E-2]
["M-EQ-BP","Male Equipped Bench",381.22073,733.79377999999997,2.3980000000000001E-2]
["F-CL-PL","Female Classic 3-Lift",610.32795999999996,1045.5928200000001,3.048E-2]
["F-CL-BP","Female Classic Bench",142.40397999999999,442.52670999999998,4.7239999999999997E-2]
["F-EQ-PL","Female Equipped 3-Lift",758.63878,949.31381999999996,2.435E-2]
["F-EQ-BP","Female Equipped Bench",221.82209,357.00376999999997,2.937E-2]

{"sheet":"WeightClasses","index":3,"n_rows":18,"n_cols":5,"rows_kept":18,"cut":false,"hidden":true,"merged":[]}
[null,"F","M","F-Jr","M-Jr"]
[10,47,59,43,53]
[43.01,47,59,47,53]
[47.01,52,59,52,53]
[52.01,57,59,57,53]
[53.01,57,59,57,59]
[57.01,63,59,63,59]
[59.01,63,66,63,66]
[63.01,69,66,69,66]
[66.010000000000005,69,74,69,74]
[69.010000000000005,76,74,76,74]
[74.010000000000005,76,83,76,83]
[76.010000000000005,84,83,84,83]
[83.01,84,93,84,93]
[84.01,84.1,93,84.1,93]
[93.01,84.1,105,84.1,105]
[105.01,84.1,120,84.1,120]
[120.01,84.1,120.1,84.1,120.1]

{"sheet":"IPFDivision","index":4,"n_rows":32,"n_cols":6,"rows_kept":32,"cut":false,"hidden":false,"merged":[]}
["Abbrev","Description"]
["F-SJr"," Women (14 -18)",null,null,"Grupo"," Lote"]
["F-Jr"," Women (19 -23)",null,null,1,7]
["F-O"," Women",null,null,2,28]
["F-M1"," Women (40 -49)",null,null,3,5]
["F-M2"," Women (50 -59)",null,null,4,22]
["F-M3"," Women (60 -69)",null,null,null,13]
["F-M4"," Women (70+) -",null,null,null,8]
["M-SJr"," Men (14 -18)",null,null,null,26]
["M-Jr"," Men (19 -23)",null,null,null,10]
["M-O"," Men",null,null,null,14]
["M-M1"," Men (40 -49)",null,null,null,16]
["M-M2"," Men (50 -59)",null,null,null,4]
["M-M3"," Men (60 -69)",null,null,null,29]
["M-M4"," Men (70+) -",null,null,null,9]
[null,null,null,null,null,2]
[null,null,null,null,null,1]
[null,null,null,null,null,6]
[null,null,null,null,null,30]
[null,null,null,null,null,27]
[null,null,null,null,null,20]
[null,null,null,null,null,25]
[null,null,null,null,null,21]
[null,null,null,null,null,3]
[null,null,null,null,null,18]
[null,null,null,null,null,15]
[null,null,null,null,null,12]
[null,null,null,null,null,17]
[null,null,null,null,null,24]
[null,null,null,null,null,11]
{"$rows_left_out":3}
{"sheet":"carga","index":5,"n_rows":876,"n_cols":6,"rows_kept":876,"cut":false,"hidden":true,"merged":[[0,1,0,4]]}
["INTENTO","CARGA  DE BARRA   POR   LADO"]
[25,0]
[25.5,0.25]
[26,0.5]
[26.5,0.75]
[27,1]
[27.5,1.25]
[28,1.25,0.25]
[28.5,1.25,0.5]
[29,1.25,0.75]
[29.5,1.25,1]
[30,2.5]
[30.5,2.5,0.25]
[31,2.5,0.5]
[31.5,2.5,0.75]
[32,2.5,1]
[32.5,2.5,1.25]
[33,2.5,1.25,0.25]
[33.5,2.5,1.25,0.5]
[34,2.5,1.25,0.75]
[34.5,2.5,1.25,1]
[35,5]
[35.5,5,0.25]
[36,5,0.5]
[36.5,5,0.75]
[37,5,1]
[37.5,5,1.25]
[38,5,1.25,0.25]
[38.5,5,1.25,0.5]
[39,5,1.25,0.75]
{"$rows_left_out":847}
{"sheet":"Premiacion","index":6,"n_rows":39,"n_cols":13,"rows_kept":39,"cut":false,"hidden":false,"merged":[]}
[]
[true,false,false,false,false,true,false,false,false,false,false,false,false]
[false,false,false,false,false,true,false,false,false,false,false,false,false]
[false,false,false,false,false,true,false,false,false,false,false,false,false]
[false,false,true,false,false,false,false,true,true,false,false,false,false]
[false,false,false,false,false,false,false,false,false,false,false,false,false]
[false,false,false,false,true,false,false,false,true,false,false,false,false]
[false,false,true,false,false,false,false,false,true,false,false,false,false]
[]
[false,false,true,false,false,true,false,false,false,false,false,false,false]
[]
[false,false,false,false,false,false,false,false,true,false,false,false,false]
[]
[false,false,false,true,false,false,false,false,true,false,false,false,false]
[false,false,false,false,false,false,false,false,false,false,false,false,false]
[false,true,true,false,true,false,false,true,true,false,false,false,false]
[]
[false,false,false,true,false,false,false,false,false,false,false,false,false]
[false,false,false,false,false,false,false,false,false,false,false,false,false]
[false,false,false,false,false,false,false,false,false,false,false,false,false]
[false,false,false,false,false,false,false,false,false,false,false,false,false]
[false,false,false,false,false,false,false,false,false,false,false,false,false]
[false,false,false,false,false,false,false,false,false,false,false,false,false]
[false,false,false,false,false,false,false,false,false,false,false,false,false]
[false,false,false,false,false,false,false,false,false,false,false,false,false]
[false,false,false,false,false,false,false,false,false,false,false,false,false]
[false,false,false,false,false,false,false,false,false,false,false,false,false]
[false,false,false,false,false,false,false,false,false,false,false,false,false]
[false,false,false,false,false,false,false,false,false,false,false,false,false]
[false,false,false,false,false,false,false,false,false,false,false,false,false]
{"$rows_left_out":9}