{"text_format":"1","workbook":"xlsx","n_sheets":4,"sheets":["Scoresheet","Instructions","IPF GL Formula","WeightClasses"],"not_rendered":{"charts":0,"images":4,"macros":1,"external_links":0,"defined_names":1,"comments":0,"pivot_tables":0},"unopened":[],"bounds":{"document_bytes":16777216,"sheet_cells":100000,"rows_first":2000,"rows_last":500,"rows_between":2000,"halvings":0,"cell_chars":16384,"cell_head_chars":4096},"cells_cut":0,"cells_raw":0,"read":"whole","date_system":"1900"}

{"sheet":"Scoresheet","index":0,"n_rows":105,"n_cols":47,"rows_kept":105,"cut":false,"hidden":false,"merged":[[1,4,1,16],[2,4,2,16],[3,9,3,10],[3,25,3,26],[0,4,0,16],[3,27,3,28],[3,23,3,24],[3,11,3,12],[3,13,3,14],[3,16,3,17],[3,18,3,19],[3,20,3,21]]}
[null,null,null,null,"World Open Championships",null,null,null,null,null,null,null,null,null,null,null,null,null,"√","Good"]
[null,null,null,null,"United Arab Emirates, Dubai",null,null,null,null,null,null,null,null,null,null,null,null,null,"×","NoLift"]
[null,null,null,null,"18-23 NOV 2019"]
["Gr.","Lot","Last \nName","First Name","Team","Birth Year","Division","Body Wt","WT Class","SQ-1",null,"SQ-2",null,"SQ-3",null,"Best SQ","BP-1",null,"BP-2",null,"BP-3",null,"Best BP","DL-1",null,"DL-2",null,"DL-3",null,"Best DL","TOTAL","IPF GL Pts.","IPF GL Coeff."]
[null,null,null,null,null,null,null,null,{"$f":"IF(H5=\"\",\"\",VLOOKUP(H5,WeightClasses!$A$2:$E$18,IF(LEFT(G5,1)=\"F\",IF(YEAR(TODAY())-F5<24,4,2),IF(YEAR(TODAY())-F5<24,5,3)),TRUE))","v":""},null,null,null,null,null,null,{"$f":"IF(OR(K5<>0,M5<>0,O5<>0),MAX(IF(J5=$S$1,K5,0),IF(L5=$S$1,M5,0),IF(N5=$S$1,O5,0)),\"\")","v":""},null,null,null,null,null,null,{"$f":"IF(OR(R5<>0,T5<>0,V5<>0),MAX(IF(Q5=$S$1,R5,0),IF(S5=$S$1,T5,0),IF(U5=$S$1,V5,0)),\"\")","v":""},null,null,null,null,null,null,{"$f":"IF(OR(Y5<>0,AA5<>0,AC5<>0),MAX(IF(X5=$S$1,Y5,0),IF(Z5=$S$1,AA5,0),IF(AB5=$S$1,AC5,0)),\"\")","v":""},{"$f":"IF(OR(P5<>\"\",W5<>\"\",AD5<>\"\"),IF(AU5,\"DSQ\",IF(AND(RIGHT(G5,2)=\"PL\"),IF(P5=\"\",0,P5)+IF(W5=\"\",0,W5)+IF(AD5=\"\",0,AD5),IF(AND(RIGHT(G5,2)=\"BP\",W5<>0),W5,0))),\"\")","v":""},{"$f":"IF(AND(AE5<>\"\",ISNUMBER(AE5)),AG5*AE5,\"\")","v":""},{"$f":"IF(OR(H5=\"\",H5=0),0, ROUND(100/(VLOOKUP($G5,'IPF GL Formula'!$A$4:$F$11,3,FALSE)-VLOOKUP($G5,'IPF GL Formula'!$A$4:$F$11,4,FALSE)*EXP(-VLOOKUP($G5,'IPF GL Formula'!$A$4:$F$11,5,FALSE)*H5)),6))","v":0},null,{"$f":"J5=$S$2","v":false},{"$f":"L5=$S$2","v":false},{"$f":"N5=$S$2","v":false},{"$f":"Q5=$S$2","v":false},{"$f":"S5=$S$2","v":false},{"$f":"U5=$S$2","v":false},{"$f":"X5=$S$2","v":false},{"$f":"Z5=$S$2","v":false},{"$f":"AB5=$S$2","v":false},{"$f":"AND(AI5,AJ5,AK5)","v":false},{"$f":"AND(AL5,AM5,AN5)","v":false},{"$f":"AND(AO5,AP5,AQ5)","v":false},{"$f":"OR(AR5,AS5,AT5)","v":false}]
[null,null,null,null,null,null,null,null,{"$f":"IF(H6=\"\",\"\",VLOOKUP(H6,WeightClasses!$A$2:$E$18,IF(LEFT(G6,1)=\"F\",IF(YEAR(TODAY())-F6<24,4,2),IF(YEAR(TODAY())-F6<24,5,3)),TRUE))","v":""},null,null,null,null,null,null,"",null,null,null,null,null,null,{"$f":"IF(OR(R6<>0,T6<>0,V6<>0),MAX(IF(Q6=$S$1,R6,0),IF(S6=$S$1,T6,0),IF(U6=$S$1,V6,0)),\"\")","v":""},null,null,null,null,null,null,{"$f":"IF(OR(Y6<>0,AA6<>0,AC6<>0),MAX(IF(X6=$S$1,Y6,0),IF(Z6=$S$1,AA6,0),IF(AB6=$S$1,AC6,0)),\"\")","v":""},{"$f":"IF(OR(P6<>\"\",W6<>\"\",AD6<>\"\"),IF(AU6,\"DSQ\",IF(AND(RIGHT(G6,2)=\"PL\"),IF(P6=\"\",0,P6)+IF(W6=\"\",0,W6)+IF(AD6=\"\",0,AD6),IF(AND(RIGHT(G6,2)=\"BP\",W6<>0),W6,0))),\"\")","v":""},"",{"$f":"IF(OR(H6=\"\",H6=0),0, ROUND(100/(VLOOKUP($G6,'IPF GL Formula'!$A$4:$F$11,3,FALSE)-VLOOKUP($G6,'IPF GL Formula'!$A$4:$F$11,4,FALSE)*EXP(-VLOOKUP($G6,'IPF GL Formula'!$A$4:$F$11,5,FALSE)*H6)),6))","v":0},null,{"$f":"J6=$S$2","v":false},{"$f":"L6=$S$2","v":false},{"$f":"N6=$S$2","v":false},{"$f":"Q6=$S$2","v":false},{"$f":"S6=$S$2","v":false},{"$f":"U6=$S$2","v":false},{"$f":"X6=$S$2","v":false},{"$f":"Z6=$S$2","v":false},{"$f":"AB6=$S$2","v":false},{"$f":"AND(AI6,AJ6,AK6)","v":false},{"$f":"AND(AL6,AM6,AN6)","v":false},{"$f":"AND(AO6,AP6,AQ6)","v":false},{"$f":"OR(AR6,AS6,AT6)","v":false}]
[null,null,null,null,null,null,null,null,{"$f":"IF(H7=\"\",\"\",VLOOKUP(H7,WeightClasses!$A$2:$E$18,IF(LEFT(G7,1)=\"F\",IF(YEAR(TODAY())-F7<24,4,2),IF(YEAR(TODAY())-F7<24,5,3)),TRUE))","v":""},null,null,null,null,null,null,"",null,null,null,null,null,null,"",null,null,null,null,null,null,"","","",{"$f":"IF(OR(H7=\"\",H7=0),0, ROUND(100/(VLOOKUP($G7,'IPF GL Formula'!$A$4:$F$11,3,FALSE)-VLOOKUP($G7,'IPF GL Formula'!$A$4:$F$11,4,FALSE)*EXP(-VLOOKUP($G7,'IPF GL Formula'!$A$4:$F$11,5,FALSE)*H7)),6))","v":0},null,false,false,false,false,false,false,false,false,false,false,false,false,false]
[null,null,null,null,null,null,null,null,{"$f":"IF(H8=\"\",\"\",VLOOKUP(H8,WeightClasses!$A$2:$E$18,IF(LEFT(G8,1)=\"F\",IF(YEAR(TODAY())-F8<24,4,2),IF(YEAR(TODAY())-F8<24,5,3)),TRUE))","v":""},null,null,null,null,null,null,"",null,null,null,null,null,null,"",null,null,null,null,null,null,"","","",{"$f":"IF(OR(H8=\"\",H8=0),0, ROUND(100/(VLOOKUP($G8,'IPF GL Formula'!$A$4:$F$11,3,FALSE)-VLOOKUP($G8,'IPF GL Formula'!$A$4:$F$11,4,FALSE)*EXP(-VLOOKUP($G8,'IPF GL Formula'!$A$4:$F$11,5,FALSE)*H8)),6))","v":0},null,false,false,false,false,false,false,false,false,false,false,false,false,false]
[null,null,null,null,null,null,null,null,{"$f":"IF(H9=\"\",\"\",VLOOKUP(H9,WeightClasses!$A$2:$E$18,IF(LEFT(G9,1)=\"F\",IF(YEAR(TODAY())-F9<24,4,2),IF(YEAR(TODAY())-F9<24,5,3)),TRUE))","v":""},null,null,null,null,null,null,"",null,null,null,null,null,null,"",null,null,null,null,null,null,"","","",{"$f":"IF(OR(H9=\"\",H9=0),0, ROUND(100/(VLOOKUP($G9,'IPF GL Formula'!$A$4:$F$11,3,FALSE)-VLOOKUP($G9,'IPF GL Formula'!$A$4:$F$11,4,FALSE)*EXP(-VLOOKUP($G9,'IPF GL Formula'!$A$4:$F$11,5,FALSE)*H9)),6))","v":0},null,false,false,false,false,false,false,false,false,false,false,false,false,false]
[null,null,null,null,null,null,null,null,{"$f":"IF(H10=\"\",\"\",VLOOKUP(H10,WeightClasses!$A$2:$E$18,IF(LEFT(G10,1)=\"F\",IF(YEAR(TODAY())-F10<24,4,2),IF(YEAR(TODAY())-F10<24,5,3)),TRUE))","v":""},null,null,null,null,null,null,"",null,null,null,null,null,null,"",null,null,null,null,null,null,"","","",{"$f":"IF(OR(H10=\"\",H10=0),0, ROUND(100/(VLOOKUP($G10,'IPF GL Formula'!$A$4:$F$11,3,FALSE)-VLOOKUP($G10,'IPF GL Formula'!$A$4:$F$11,4,FALSE)*EXP(-VLOOKUP($G10,'IPF GL Formula'!$A$4:$F$11,5,FALSE)*H10)),6))","v":0},null,false,false,false,false,false,false,false,false,false,false,false,false,false]
[null,null,null,null,null,null,null,null,{"$f":"IF(H11=\"\",\"\",VLOOKUP(H11,WeightClasses!$A$2:$E$18,IF(LEFT(G11,1)=\"F\",IF(YEAR(TODAY())-F11<24,4,2),IF(YEAR(TODAY())-F11<24,5,3)),TRUE))","v":""},null,null,null,null,null,null,"",null,null,null,null,null,null,"",null,null,null,null,null,null,"","","",{"$f":"IF(OR(H11=\"\",H11=0),0, ROUND(100/(VLOOKUP($G11,'IPF GL Formula'!$A$4:$F$11,3,FALSE)-VLOOKUP($G11,'IPF GL Formula'!$A$4:$F$11,4,FALSE)*EXP(-VLOOKUP($G11,'IPF GL Formula'!$A$4:$F$11,5,FALSE)*H11)),6))","v":0},null,false,false,false,false,false,false,false,false,false,false,false,false,false]
[null,null,null,null,null,null,null,null,{"$f":"IF(H12=\"\",\"\",VLOOKUP(H12,WeightClasses!$A$2:$E$18,IF(LEFT(G12,1)=\"F\",IF(YEAR(TODAY())-F12<24,4,2),IF(YEAR(TODAY())-F12<24,5,3)),TRUE))","v":""},null,null,null,null,null,null,{"$f":"IF(OR(K12<>0,M12<>0,O12<>0),MAX(IF(J12=$S$1,K12,0),IF(L12=$S$1,M12,0),IF(N12=$S$1,O12,0)),\"\")","v":""},null,null,null,null,null,null,"",null,null,null,null,null,null,"","",{"$f":"IF(AND(AE12<>\"\",ISNUMBER(AE12)),AG12*AE12,\"\")","v":""},{"$f":"IF(OR(H12=\"\",H12=0),0, ROUND(100/(VLOOKUP($G12,'IPF GL Formula'!$A$4:$F$11,3,FALSE)-VLOOKUP($G12,'IPF GL Formula'!$A$4:$F$11,4,FALSE)*EXP(-VLOOKUP($G12,'IPF GL Formula'!$A$4:$F$11,5,FALSE)*H12)),6))","v":0},null,false,false,false,false,false,false,false,false,false,false,false,false,false]
[null,null,null,null,null,null,null,null,{"$f":"IF(H13=\"\",\"\",VLOOKUP(H13,WeightClasses!$A$2:$E$18,IF(LEFT(G13,1)=\"F\",IF(YEAR(TODAY())-F13<24,4,2),IF(YEAR(TODAY())-F13<24,5,3)),TRUE))","v":""},null,null,null,null,null,null,{"$f":"IF(OR(K13<>0,M13<>0,O13<>0),MAX(IF(J13=$S$1,K13,0),IF(L13=$S$1,M13,0),IF(N13=$S$1,O13,0)),\"\")","v":""},null,null,null,null,null,null,"",null,null,null,null,null,null,"","",{"$f":"IF(AND(AE13<>\"\",ISNUMBER(AE13)),AG13*AE13,\"\")","v":""},{"$f":"IF(OR(H13=\"\",H13=0),0, ROUND(100/(VLOOKUP($G13,'IPF GL Formula'!$A$4:$F$11,3,FALSE)-VLOOKUP($G13,'IPF GL Formula'!$A$4:$F$11,4,FALSE)*EXP(-VLOOKUP($G13,'IPF GL Formula'!$A$4:$F$11,5,FALSE)*H13)),6))","v":0},null,false,false,false,false,false,false,false,false,false,false,false,false,false]
[null,null,null,null,null,null,null,null,{"$f":"IF(H14=\"\",\"\",VLOOKUP(H14,WeightClasses!$A$2:$E$18,IF(LEFT(G14,1)=\"F\",IF(YEAR(TODAY())-F14<24,4,2),IF(YEAR(TODAY())-F14<24,5,3)),TRUE))","v":""},null,null,null,null,null,null,"",null,null,null,null,null,null,"",null,null,null,null,null,null,"","","",{"$f":"IF(OR(H14=\"\",H14=0),0, ROUND(100/(VLOOKUP($G14,'IPF GL Formula'!$A$4:$F$11,3,FALSE)-VLOOKUP($G14,'IPF GL Formula'!$A$4:$F$11,4,FALSE)*EXP(-VLOOKUP($G14,'IPF GL Formula'!$A$4:$F$11,5,FALSE)*H14)),6))","v":0},null,false,false,false,false,false,false,false,false,false,false,false,false,false]
[null,null,null,null,null,null,null,null,{"$f":"IF(H15=\"\",\"\",VLOOKUP(H15,WeightClasses!$A$2:$E$18,IF(LEFT(G15,1)=\"F\",IF(YEAR(TODAY())-F15<24,4,2),IF(YEAR(TODAY())-F15<24,5,3)),TRUE))","v":""},null,null,null,null,null,null,"",null,null,null,null,null,null,"",null,null,null,null,null,null,"","","",{"$f":"IF(OR(H15=\"\",H15=0),0, ROUND(100/(VLOOKUP($G15,'IPF GL Formula'!$A$4:$F$11,3,FALSE)-VLOOKUP($G15,'IPF GL Formula'!$A$4:$F$11,4,FALSE)*EXP(-VLOOKUP($G15,'IPF GL Formula'!$A$4:$F$11,5,FALSE)*H15)),6))","v":0},null,false,false,false,false,false,false,false,false,false,false,false,false,false]
[null,null,null,null,null,null,null,null,{"$f":"IF(H16=\"\",\"\",VLOOKUP(H16,WeightClasses!$A$2:$E$18,IF(LEFT(G16,1)=\"F\",IF(YEAR(TODAY())-F16<24,4,2),IF(YEAR(TODAY())-F16<24,5,3)),TRUE))","v":""},null,null,null,null,null,null,"",null,null,null,null,null,null,"",null,null,null,null,null,null,"","","",{"$f":"IF(OR(H16=\"\",H16=0),0, ROUND(100/(VLOOKUP($G16,'IPF GL Formula'!$A$4:$F$11,3,FALSE)-VLOOKUP($G16,'IPF GL Formula'!$A$4:$F$11,4,FALSE)*EXP(-VLOOKUP($G16,'IPF GL Formula'!$A$4:$F$11,5,FALSE)*H16)),6))","v":0},null,false,false,false,false,false,false,false,false,false,false,false,false,false]
[null,null,null,null,null,null,null,null,{"$f":"IF(H17=\"\",\"\",VLOOKUP(H17,WeightClasses!$A$2:$E$18,IF(LEFT(G17,1)=\"F\",IF(YEAR(TODAY())-F17<24,4,2),IF(YEAR(TODAY())-F17<24,5,3)),TRUE))","v":""},null,null,null,null,null,null,"",null,null,null,null,null,null,"",null,null,null,null,null,null,"","","",{"$f":"IF(OR(H17=\"\",H17=0),0, ROUND(100/(VLOOKUP($G17,'IPF GL Formula'!$A$4:$F$11,3,FALSE)-VLOOKUP($G17,'IPF GL Formula'!$A$4:$F$11,4,FALSE)*EXP(-VLOOKUP($G17,'IPF GL Formula'!$A$4:$F$11,5,FALSE)*H17)),6))","v":0},null,false,false,false,false,false,false,false,false,false,false,false,false,false]
[null,null,null,null,null,null,null,null,{"$f":"IF(H18=\"\",\"\",VLOOKUP(H18,WeightClasses!$A$2:$E$18,IF(LEFT(G18,1)=\"F\",IF(YEAR(TODAY())-F18<24,4,2),IF(YEAR(TODAY())-F18<24,5,3)),TRUE))","v":""},null,null,null,null,null,null,"",null,null,null,null,null,null,"",null,null,null,null,null,null,"","","",{"$f":"IF(OR(H18=\"\",H18=0),0, ROUND(100/(VLOOKUP($G18,'IPF GL Formula'!$A$4:$F$11,3,FALSE)-VLOOKUP($G18,'IPF GL Formula'!$A$4:$F$11,4,FALSE)*EXP(-VLOOKUP($G18,'IPF GL Formula'!$A$4:$F$11,5,FALSE)*H18)),6))","v":0},null,false,false,false,false,false,false,false,false,false,false,false,false,false]
[null,null,null,null,null,null,null,null,{"$f":"IF(H19=\"\",\"\",VLOOKUP(H19,WeightClasses!$A$2:$E$18,IF(LEFT(G19,1)=\"F\",IF(YEAR(TODAY())-F19<24,4,2),IF(YEAR(TODAY())-F19<24,5,3)),TRUE))","v":""},null,null,null,null,null,null,"",null,null,null,null,null,null,"",null,null,null,null,null,null,"","","",{"$f":"IF(OR(H19=\"\",H19=0),0, ROUND(100/(VLOOKUP($G19,'IPF GL Formula'!$A$4:$F$11,3,FALSE)-VLOOKUP($G19,'IPF GL Formula'!$A$4:$F$11,4,FALSE)*EXP(-VLOOKUP($G19,'IPF GL Formula'!$A$4:$F$11,5,FALSE)*H19)),6))","v":0},null,false,false,false,false,false,false,false,false,false,false,false,false,false]
[null,null,null,null,null,null,null,null,{"$f":"IF(H20=\"\",\"\",VLOOKUP(H20,WeightClasses!$A$2:$E$18,IF(LEFT(G20,1)=\"F\",IF(YEAR(TODAY())-F20<24,4,2),IF(YEAR(TODAY())-F20<24,5,3)),TRUE))","v":""},null,null,null,null,null,null,"",null,null,null,null,null,null,"",null,null,null,null,null,null,"","","",{"$f":"IF(OR(H20=\"\",H20=0),0, ROUND(100/(VLOOKUP($G20,'IPF GL Formula'!$A$4:$F$11,3,FALSE)-VLOOKUP($G20,'IPF GL Formula'!$A$4:$F$11,4,FALSE)*EXP(-VLOOKUP($G20,'IPF GL Formula'!$A$4:$F$11,5,FALSE)*H20)),6))","v":0},null,false,false,false,false,false,false,false,false,false,false,false,false,false]
[null,null,null,null,null,null,null,null,{"$f":"IF(H21=\"\",\"\",VLOOKUP(H21,WeightClasses!$A$2:$E$18,IF(LEFT(G21,1)=\"F\",IF(YEAR(TODAY())-F21<24,4,2),IF(YEAR(TODAY())-F21<24,5,3)),TRUE))","v":""},null,null,null,null,null,null,"",null,null,null,null,null,null,"",null,null,null,null,null,null,"","","",{"$f":"IF(OR(H21=\"\",H21=0),0, ROUND(100/(VLOOKUP($G21,'IPF GL Formula'!$A$4:$F$11,3,FALSE)-VLOOKUP($G21,'IPF GL Formula'!$A$4:$F$11,4,FALSE)*EXP(-VLOOKUP($G21,'IPF GL Formula'!$A$4:$F$11,5,FALSE)*H21)),6))","v":0},null,false,false,false,false,false,false,false,false,false,false,false,false,false]
[null,null,null,null,null,null,null,null,{"$f":"IF(H22=\"\",\"\",VLOOKUP(H22,WeightClasses!$A$2:$E$18,IF(LEFT(G22,1)=\"F\",IF(YEAR(TODAY())-F22<24,4,2),IF(YEAR(TODAY())-F22<24,5,3)),TRUE))","v":""},null,null,null,null,null,null,"",null,null,null,null,null,null,"",null,null,null,null,null,null,"","","",{"$f":"IF(OR(H22=\"\",H22=0),0, ROUND(100/(VLOOKUP($G22,'IPF GL Formula'!$A$4:$F$11,3,FALSE)-VLOOKUP($G22,'IPF GL Formula'!$A$4:$F$11,4,FALSE)*EXP(-VLOOKUP($G22,'IPF GL Formula'!$A$4:$F$11,5,FALSE)*H22)),6))","v":0},null,false,false,false,false,false,false,false,false,false,false,false,false,false]
[null,null,null,null,null,null,null,null,{"$f":"IF(H23=\"\",\"\",VLOOKUP(H23,WeightClasses!$A$2:$E$18,IF(LEFT(G23,1)=\"F\",IF(YEAR(TODAY())-F23<24,4,2),IF(YEAR(TODAY())-F23<24,5,3)),TRUE))","v":""},null,null,null,null,null,null,"",null,null,null,null,null,null,"",null,null,null,null,null,null,"","","",{"$f":"IF(OR(H23=\"\",H23=0),0, ROUND(100/(VLOOKUP($G23,'IPF GL Formula'!$A$4:$F$11,3,FALSE)-VLOOKUP($G23,'IPF GL Formula'!$A$4:$F$11,4,FALSE)*EXP(-VLOOKUP($G23,'IPF GL Formula'!$A$4:$F$11,5,FALSE)*H23)),6))","v":0},null,false,false,false,false,false,false,false,false,false,false,false,false,false]
[null,null,null,null,null,null,null,null,{"$f":"IF(H24=\"\",\"\",VLOOKUP(H24,WeightClasses!$A$2:$E$18,IF(LEFT(G24,1)=\"F\",IF(YEAR(TODAY())-F24<24,4,2),IF(YEAR(TODAY())-F24<24,5,3)),TRUE))","v":""},null,null,null,null,null,null,"",null,null,null,null,null,null,"",null,null,null,null,null,null,"","","",{"$f":"IF(OR(H24=\"\",H24=0),0, ROUND(100/(VLOOKUP($G24,'IPF GL Formula'!$A$4:$F$11,3,FALSE)-VLOOKUP($G24,'IPF GL Formula'!$A$4:$F$11,4,FALSE)*EXP(-VLOOKUP($G24,'IPF GL Formula'!$A$4:$F$11,5,FALSE)*H24)),6))","v":0},null,false,false,false,false,false,false,false,false,false,false,false,false,false]
[null,null,null,null,null,null,null,null,{"$f":"IF(H25=\"\",\"\",VLOOKUP(H25,WeightClasses!$A$2:$E$18,IF(LEFT(G25,1)=\"F\",IF(YEAR(TODAY())-F25<24,4,2),IF(YEAR(TODAY())-F25<24,5,3)),TRUE))","v":""},null,null,null,null,null,null,"",null,null,null,null,null,null,"",null,null,null,null,null,null,"","","",{"$f":"IF(OR(H25=\"\",H25=0),0, ROUND(100/(VLOOKUP($G25,'IPF GL Formula'!$A$4:$F$11,3,FALSE)-VLOOKUP($G25,'IPF GL Formula'!$A$4:$F$11,4,FALSE)*EXP(-VLOOKUP($G25,'IPF GL Formula'!$A$4:$F$11,5,FALSE)*H25)),6))","v":0},null,false,false,false,false,false,false,false,false,false,false,false,false,false]
[null,null,null,null,null,null,null,null,{"$f":"IF(H26=\"\",\"\",VLOOKUP(H26,WeightClasses!$A$2:$E$18,IF(LEFT(G26,1)=\"F\",IF(YEAR(TODAY())-F26<24,4,2),IF(YEAR(TODAY())-F26<24,5,3)),TRUE))","v":""},null,null,null,null,null,null,"",null,null,null,null,null,null,"",null,null,null,null,null,null,"","","",{"$f":"IF(OR(H26=\"\",H26=0),0, ROUND(100/(VLOOKUP($G26,'IPF GL Formula'!$A$4:$F$11,3,FALSE)-VLOOKUP($G26,'IPF GL Formula'!$A$4:$F$11,4,FALSE)*EXP(-VLOOKUP($G26,'IPF GL Formula'!$A$4:$F$11,5,FALSE)*H26)),6))","v":0},null,false,false,false,false,false,false,false,false,false,false,false,false,false]
[null,null,null,null,null,null,null,null,{"$f":"IF(H27=\"\",\"\",VLOOKUP(H27,WeightClasses!$A$2:$E$18,IF(LEFT(G27,1)=\"F\",IF(YEAR(TODAY())-F27<24,4,2),IF(YEAR(TODAY())-F27<24,5,3)),TRUE))","v":""},null,null,null,null,null,null,"",null,null,null,null,null,null,"",null,null,null,null,null,null,"","","",{"$f":"IF(OR(H27=\"\",H27=0),0, ROUND(100/(VLOOKUP($G27,'IPF GL Formula'!$A$4:$F$11,3,FALSE)-VLOOKUP($G27,'IPF GL Formula'!$A$4:$F$11,4,FALSE)*EXP(-VLOOKUP($G27,'IPF GL Formula'!$A$4:$F$11,5,FALSE)*H27)),6))","v":0},null,false,false,false,false,false,false,false,false,false,false,false,false,false]
[null,null,null,null,null,null,null,null,{"$f":"IF(H28=\"\",\"\",VLOOKUP(H28,WeightClasses!$A$2:$E$18,IF(LEFT(G28,1)=\"F\",IF(YEAR(TODAY())-F28<24,4,2),IF(YEAR(TODAY())-F28<24,5,3)),TRUE))","v":""},null,null,null,null,null,null,"",null,null,null,null,null,null,"",null,null,null,null,null,null,"","","",{"$f":"IF(OR(H28=\"\",H28=0),0, ROUND(100/(VLOOKUP($G28,'IPF GL Formula'!$A$4:$F$11,3,FALSE)-VLOOKUP($G28,'IPF GL Formula'!$A$4:$F$11,4,FALSE)*EXP(-VLOOKUP($G28,'IPF GL Formula'!$A$4:$F$11,5,FALSE)*H28)),6))","v":0},null,false,false,false,false,false,false,false,false,false,false,false,false,false]
[null,null,null,null,null,null,null,null,{"$f":"IF(H29=\"\",\"\",VLOOKUP(H29,WeightClasses!$A$2:$E$18,IF(LEFT(G29,1)=\"F\",IF(YEAR(TODAY())-F29<24,4,2),IF(YEAR(TODAY())-F29<24,5,3)),TRUE))","v":""},null,null,null,null,null,null,"",null,null,null,null,null,null,"",null,null,null,null,null,null,"","","",{"$f":"IF(OR(H29=\"\",H29=0),0, ROUND(100/(VLOOKUP($G29,'IPF GL Formula'!$A$4:$F$11,3,FALSE)-VLOOKUP($G29,'IPF GL Formula'!$A$4:$F$11,4,FALSE)*EXP(-VLOOKUP($G29,'IPF GL Formula'!$A$4:$F$11,5,FALSE)*H29)),6))","v":0},null,false,false,false,false,false,false,false,false,false,false,false,false,false]
[null,null,null,null,null,null,null,null,{"$f":"IF(H30=\"\",\"\",VLOOKUP(H30,WeightClasses!$A$2:$E$18,IF(LEFT(G30,1)=\"F\",IF(YEAR(TODAY())-F30<24,4,2),IF(YEAR(TODAY())-F30<24,5,3)),TRUE))","v":""},null,null,null,null,null,null,"",null,null,null,null,null,null,"",null,null,null,null,null,null,"","","",{"$f":"IF(OR(H30=\"\",H30=0),0, ROUND(100/(VLOOKUP($G30,'IPF GL Formula'!$A$4:$F$11,3,FALSE)-VLOOKUP($G30,'IPF GL Formula'!$A$4:$F$11,4,FALSE)*EXP(-VLOOKUP($G30,'IPF GL Formula'!$A$4:$F$11,5,FALSE)*H30)),6))","v":0},null,false,false,false,false,false,false,false,false,false,false,false,false,false]
{"$rows_left_out":76}
{"sheet":"Instructions","index":1,"n_rows":57,"n_cols":3,"rows_kept":57,"cut":false,"hidden":false,"merged":[]}
[]
[null,"1.  Enter lifter information into the spreadsheet in the approriate columns.  Column titles can be changed or Translated to another language after Unprotecting the Spreadsheet."]
[null,null,"A separate Scoresheet can be created for each Men/Women, Classic/Equipped, Powerlifting/Bench Press or they may all be entered on the same scoresheet."]
[]
[null,"2.  When Birth Year and Body Weight are entered the will automatically determine the correct WT Class."]
[]
[null,"3.  Any of the 8 IPF GL Formulas can be selected for a lifter.  A description of the each formula can be found on the IPF GL Formula sheet.  Use the drop down menu in the cell."]
[null,null,"Lifter1 in the first row is entered in Female-Classic-Powerlifting.  The IPF Formula to calculate her IPF Points is F-CL-PL."]
[]
[null,"4.  The gray areas contain formulas and information that will be protected when you Protect the spreadsheet "]
[]
[]
[]
[]
[]
[]
[]
[]
[]
[]
[]
[]
[]
[]
[]
[]
[null,"5.  You may unprotect the Scoresheet to use the sort functions in Excel to group competitors by weight class, age division, or IPF GL Formula."]
[]
[null,"6.  When a lifter completes an attempt, click in the cell next to the weight."]
[null,null,"For a Good Lift select √.  The cell will turn green. Example:  Osmialowski, SQ-1."]
{"$rows_left_out":28}
{"sheet":"IPF GL Formula","index":2,"n_rows":11,"n_cols":5,"rows_kept":11,"cut":false,"hidden":false,"merged":[[0,0,1,4]]}
["Reference Values"]
[]
["IPF GL Formula","Description","A","B","C"]
["M-CL-PL","Male Classic 3-Lift",1199.72839,1025.1816200000001,9.2099999999999994E-3]
["M-CL-BP","Male Classic Bench",320.98041000000001,281.40258,1.008E-2]
["M-EQ-PL","Male Equipped 3-Lift",1236.2511500000001,1449.2186400000001,1.644E-2]
["M-EQ-BP","Male Equipped Bench",381.22073,733.79377999999997,2.3980000000000001E-2]
["F-CL-PL","Female Classic 3-Lift",610.32795999999996,1045.5928200000001,3.048E-2]
["F-CL-BP","Female Classic Bench",142.40397999999999,442.52670999999998,4.7239999999999997E-2]
["F-EQ-PL","Female Equipped 3-Lift",758.63878,949.31381999999996,2.435E-2]
["F-EQ-BP","Female Equipped Bench",221.82209,357.00376999999997,2.937E-2]

{"sheet":"WeightClasses","index":3,"n_rows":18,"n_cols":5,"rows_kept":18,"cut":false,"hidden":true,"merged":[]}
[null,"F","M","F-Jr","M-Jr"]
[10,47,59,43,53]
[43.01,47,59,47,53]
[47.01,52,59,52,53]
[52.01,57,59,57,53]
[53.01,57,59,57,59]
[57.01,63,59,63,59]
[59.01,63,66,63,66]
[63.01,69,66,69,66]
[66.010000000000005,69,74,69,74]
[69.010000000000005,76,74,76,74]
[74.010000000000005,76,83,76,83]
[76.010000000000005,84,83,84,83]
[83.01,84,93,84,93]
[84.01,"84+",93,"84+",93]
[93.01,"84+",105,"84+",105]
[105.01,"84+",120,"84+",120]
[120.01,"84+","120+","84+","120+"]